Reaction Details
TargetPlatelet-derived growth factor receptor beta
LigandBDBM50117356
Substrate/Competitorn/a
Meas. Tech.ChEBML_158654
IC50 20±n/a nM
Citation Pandey, AVolkots, DLSeroogy, JMRose, JWYu, JCLambing, JLHutchaleelaha, AHollenbach, SJAbe, KGiese, NAScarborough, RM Identification of orally active, potent, and selective 4-piperazinylquinazolines as antagonists of the platelet-derived growth factor receptor tyrosine kinase family. J Med Chem45:3772-93 (2002) Platelet-derived growth factor receptor beta
Name:Platelet-derived growth factor receptor beta
Type:Enzyme
Mol. Mass.:123922.25
Organism:Homo sapiens (Human)
Description:P09619
Residue:1106
BDBM50117356
NameBDBM50117356
Synonyms:4-[6,7-Bis-(2-methoxy-ethoxy)-quinazolin-4-yl]-piperazine-1-carboxylic acid [4-(2,3-dihydro-1H-indol-4-yloxy)-phenyl]-amide | CHEMBL340157
TypeSmall organic molecule
Emp. Form.C33H38N6O6
Mol. Mass.614.6914
SMILESCOCCOc1cc2ncnc(N3CCN(CC3)C(=O)Nc3ccc(Oc4cccc5NCCc45)cc3)c2cc1OCCOC