Reaction Details
TargetPlatelet-derived growth factor receptor beta
LigandBDBM50117312
Substrate/Competitorn/a
Meas. Tech.ChEMBL_158654 (CHEMBL763440)
IC50 73±n/a nM
Citation Pandey, AVolkots, DLSeroogy, JMRose, JWYu, JCLambing, JLHutchaleelaha, AHollenbach, SJAbe, KGiese, NAScarborough, RM Identification of orally active, potent, and selective 4-piperazinylquinazolines as antagonists of the platelet-derived growth factor receptor tyrosine kinase family. J Med Chem45:3772-93 (2002) Platelet-derived growth factor receptor beta
Name:Platelet-derived growth factor receptor beta
Type:Enzyme
Mol. Mass.:123922.25
Organism:Homo sapiens (Human)
Description:P09619
Residue:1106
BDBM50117312
NameBDBM50117312
Synonyms:4-{6-Methoxy-7-[3-(4-methyl-piperidin-1-yl)-propoxy]-quinazolin-4-yl}-piperazine-1-carboxylic acid (4-cyano-phenyl)-amide | CHEMBL445636
TypeSmall organic molecule
Emp. Form.C30H37N7O3
Mol. Mass.543.6599
SMILESCOc1cc2c(ncnc2cc1OCCCN1CCC(C)CC1)N1CCN(CC1)C(=O)Nc1ccc(cc1)C#N