Reaction Details
Target5-hydroxytryptamine receptor 2A
LigandBDBM21342
Substrate/Competitorn/a
Meas. Tech.ChEMBL_2638 (CHEMBL872922)
Ki 3.5±n/a nM
Citation Nichols, DEFrescas, SMarona-Lewicka, DKurrasch-Orbaugh, DM Lysergamides of isomeric 2,4-dimethylazetidines map the binding orientation of the diethylamide moiety in the potent hallucinogenic agent N,N-diethyllysergamide (LSD). J Med Chem45:4344-9 (2002) 5-hydroxytryptamine receptor 2A
Name:5-hydroxytryptamine receptor 2A
Type:G Protein-Coupled Receptor (GPCR)
Mol. Mass.:52852.05
Organism:Rattus norvegicus (rat)
Description:Rat cortex membranes 5-HT2A receptors.
Residue:471
BDBM21342
NameBDBM21342
Synonyms:(4R,7R)-N,N-diethyl-6-methyl-6,11-diazatetracyclo[7.6.1.0^{2,7}.0^{12,16}]hexadeca-1(16),2,9,12,14-pentaene-4-carboxamide LSD LSD,(+) Lysergic Acid Diethylamide [3H]-LSD | d-Isolysergic acid amide
Typeradiolabeled ligand
Emp. Form.C20H25N3O
Mol. Mass.323.432
SMILES[H][C@@]12Cc3c[nH]c4cccc(C1=C[C@H](CN2C)C(=O)N(CC)CC)c34