Reaction Details
Target5-hydroxytryptamine receptor 2A
LigandBDBM50108700
Substrate/Competitorn/a
Meas. Tech.ChEMBL_2290 (CHEMBL617075)
Ki 1.8±n/a nM
Citation Fletcher, SRBurkamp, FBlurton, PCheng, SKClarkson, RO'Connor, DSpinks, DTudge, Mvan Niel, MBPatel, SChapman, KMarwood, RShepheard, SBentley, GCook, GPBristow, LJCastro, JLHutson, PHMacLeod, AM 4-(Phenylsulfonyl)piperidines: novel, selective, and bioavailable 5-HT(2A) receptor antagonists. J Med Chem45:492-503 (2002) 5-hydroxytryptamine receptor 2A
Name:5-hydroxytryptamine receptor 2A
Type:undefined
Mol. Mass.:52607.65
Organism:Homo sapiens (Human)
Description:P28223
Residue:471
BDBM50108700
NameBDBM50108700
Synonyms:1'-(2,4-difluorophenethyl)-6-methoxyspiro[3,4-dihydro-2H-chromene-2,4'-(hexahydropyridine)] CHEMBL146233
TypeSmall organic molecule
Emp. Form.C22H25F2NO2
Mol. Mass.373.4362
SMILESCOc1ccc2OC3(CCN(CCc4ccc(F)cc4F)CC3)CCc2c1