Reaction Details
TargetD(2) dopamine receptor
LigandBDBM50108709
Substrate/Competitorn/a
Meas. Tech.ChEMBL_87873 (CHEMBL697295)
Ki 650±n/a nM
Citation Fletcher, SRBurkamp, FBlurton, PCheng, SKClarkson, RO'Connor, DSpinks, DTudge, Mvan Niel, MBPatel, SChapman, KMarwood, RShepheard, SBentley, GCook, GPBristow, LJCastro, JLHutson, PHMacLeod, AM 4-(Phenylsulfonyl)piperidines: novel, selective, and bioavailable 5-HT(2A) receptor antagonists. J Med Chem45:492-503 (2002) D(2) dopamine receptor
Name:D(2) dopamine receptor
Type:Cell-surface receptors
Mol. Mass.:50647.10
Organism:Homo sapiens (Human)
Description:P14416
Residue:443
BDBM50108709
NameBDBM50108709
Synonyms:1'-(2,4-difluorophenethyl)-6-fluorospiro[2H-chromene-2,4'-(hexahydropyridine)] | CHEMBL359270
TypeSmall organic molecule
Emp. Form.C21H20F3NO
Mol. Mass.359.3848
SMILESFc1ccc(CCN2CCC3(CC2)Oc2ccc(F)cc2C=C3)c(F)c1