Reaction Details
Target5-hydroxytryptamine receptor 2A
LigandBDBM50108706
Substrate/Competitorn/a
Meas. Tech.ChEMBL_2290 (CHEMBL617075)
Ki 0.52±n/a nM
Citation Fletcher, SRBurkamp, FBlurton, PCheng, SKClarkson, RO'Connor, DSpinks, DTudge, Mvan Niel, MBPatel, SChapman, KMarwood, RShepheard, SBentley, GCook, GPBristow, LJCastro, JLHutson, PHMacLeod, AM 4-(Phenylsulfonyl)piperidines: novel, selective, and bioavailable 5-HT(2A) receptor antagonists. J Med Chem45:492-503 (2002) 5-hydroxytryptamine receptor 2A
Name:5-hydroxytryptamine receptor 2A
Type:undefined
Mol. Mass.:52607.65
Organism:Homo sapiens (Human)
Description:P28223
Residue:471
BDBM50108706
NameBDBM50108706
Synonyms:4-[[1-(2-(2,4-Difluorophenyl)ethyl)-4-piperidinyl]sulfonyl]benzamide CHEMBL148058
TypeSmall organic molecule
Emp. Form.C20H22F2N2O3S
Mol. Mass.408.462
SMILESNC(=O)c1ccc(cc1)S(=O)(=O)C1CCN(CCc2ccc(F)cc2F)CC1