Reaction Details
Target5-hydroxytryptamine receptor 2C
LigandBDBM50036756
Substrate/Competitorn/a
Meas. Tech.ChEMBL_2969 (CHEMBL620617)
Ki 230±n/a nM
Citation Fletcher, SRBurkamp, FBlurton, PCheng, SKClarkson, RO'Connor, DSpinks, DTudge, Mvan Niel, MBPatel, SChapman, KMarwood, RShepheard, SBentley, GCook, GPBristow, LJCastro, JLHutson, PHMacLeod, AM 4-(Phenylsulfonyl)piperidines: novel, selective, and bioavailable 5-HT(2A) receptor antagonists. J Med Chem45:492-503 (2002) 5-hydroxytryptamine receptor 2C
Name:5-hydroxytryptamine receptor 2C
Type:G Protein-Coupled Receptor (GPCR)
Mol. Mass.:51836.79
Organism:Homo sapiens (Human)
Description:P28335
Residue:458
BDBM50036756
NameBDBM50036756
Synonyms:1'-phenethylspiro[1,2,3,4-tetrahydronaphthalene-2,4'-(hexahydropyridine)]-1-ol; hydrochloride CHEMBL542942
TypeSmall organic molecule
Emp. Form.C22H27NO
Mol. Mass.321.4559
SMILESOC1c2ccccc2CCC11CCN(CCc2ccccc2)CC1