Reaction Details
Target5-hydroxytryptamine receptor 2A
LigandBDBM50108713
Substrate/Competitorn/a
Meas. Tech.ChEMBL_2290 (CHEMBL617075)
Ki 16±n/a nM
Citation Fletcher, SRBurkamp, FBlurton, PCheng, SKClarkson, RO'Connor, DSpinks, DTudge, Mvan Niel, MBPatel, SChapman, KMarwood, RShepheard, SBentley, GCook, GPBristow, LJCastro, JLHutson, PHMacLeod, AM 4-(Phenylsulfonyl)piperidines: novel, selective, and bioavailable 5-HT(2A) receptor antagonists. J Med Chem45:492-503 (2002) 5-hydroxytryptamine receptor 2A
Name:5-hydroxytryptamine receptor 2A
Type:undefined
Mol. Mass.:52607.65
Organism:Homo sapiens (Human)
Description:P28223
Residue:471
BDBM50108713
NameBDBM50108713
Synonyms:1'-phenethylspiro[3,4-dihydro-2H-chromene-2,4'-(hexahydropyridine)] | CHEMBL148418
TypeSmall organic molecule
Emp. Form.C21H25NO
Mol. Mass.307.4293
SMILESC(Cc1ccccc1)N1CCC2(CC1)CCc1ccccc1O2