Reaction Details
Target5-hydroxytryptamine receptor 2A
LigandBDBM50108707
Substrate/Competitorn/a
Meas. Tech.ChEMBL_2622 (CHEMBL621534)
Ki 0.54±n/a nM
Citation Fletcher, SRBurkamp, FBlurton, PCheng, SKClarkson, RO'Connor, DSpinks, DTudge, Mvan Niel, MBPatel, SChapman, KMarwood, RShepheard, SBentley, GCook, GPBristow, LJCastro, JLHutson, PHMacLeod, AM 4-(Phenylsulfonyl)piperidines: novel, selective, and bioavailable 5-HT(2A) receptor antagonists. J Med Chem45:492-503 (2002) 5-hydroxytryptamine receptor 2A
Name:5-hydroxytryptamine receptor 2A
Type:G Protein-Coupled Receptor (GPCR)
Mol. Mass.:52852.05
Organism:Rattus norvegicus (rat)
Description:Rat cortex membranes 5-HT2A receptors.
Residue:471
BDBM50108707
NameBDBM50108707
Synonyms:3-[[1-(2-(2,4-Difluorophenyl)ethyl)-4-piperidinyl]sulfonyl]benzonitrile CHEMBL147048
TypeSmall organic molecule
Emp. Form.C20H20F2N2O2S
Mol. Mass.390.447
SMILESFc1ccc(CCN2CCC(CC2)S(=O)(=O)c2cccc(c2)C#N)c(F)c1