Reaction Details
TargetPotassium voltage-gated channel subfamily H member 2
LigandBDBM50108703
Substrate/Competitorn/a
Meas. Tech.ChEMBL_214800 (CHEMBL816205)
Ki 1800±n/a nM
Citation Fletcher, SRBurkamp, FBlurton, PCheng, SKClarkson, RO'Connor, DSpinks, DTudge, Mvan Niel, MBPatel, SChapman, KMarwood, RShepheard, SBentley, GCook, GPBristow, LJCastro, JLHutson, PHMacLeod, AM 4-(Phenylsulfonyl)piperidines: novel, selective, and bioavailable 5-HT(2A) receptor antagonists. J Med Chem45:492-503 (2002) Potassium voltage-gated channel subfamily H member 2
Name:Potassium voltage-gated channel subfamily H member 2
Type:Multi-pass membrane protein
Mol. Mass.:126672.65
Organism:Homo sapiens (Human)
Description:Q12809
Residue:1159
BDBM50108703
NameBDBM50108703
Synonyms:1-(2-Phenylethyl)-4-(phenylsulfonyl)piperidine CHEMBL148280
TypeSmall organic molecule
Emp. Form.C19H23NO2S
Mol. Mass.329.456
SMILESO=S(=O)(C1CCN(CCc2ccccc2)CC1)c1ccccc1