Reaction Details
Target5-hydroxytryptamine receptor 2C
LigandBDBM50108697
Substrate/Competitorn/a
Meas. Tech.ChEMBL_2969 (CHEMBL620617)
Ki 450±n/a nM
Citation Fletcher, SRBurkamp, FBlurton, PCheng, SKClarkson, RO'Connor, DSpinks, DTudge, Mvan Niel, MBPatel, SChapman, KMarwood, RShepheard, SBentley, GCook, GPBristow, LJCastro, JLHutson, PHMacLeod, AM 4-(Phenylsulfonyl)piperidines: novel, selective, and bioavailable 5-HT(2A) receptor antagonists. J Med Chem45:492-503 (2002) 5-hydroxytryptamine receptor 2C
Name:5-hydroxytryptamine receptor 2C
Type:G Protein-Coupled Receptor (GPCR)
Mol. Mass.:51836.79
Organism:Homo sapiens (Human)
Description:P28335
Residue:458
BDBM50108697
NameBDBM50108697
Synonyms:1'-(2,4-difluorophenethyl)spiro[3,4-dihydro-2H-chromene-2,4'-(hexahydropyridine)] CHEMBL147431
TypeSmall organic molecule
Emp. Form.C21H23F2NO
Mol. Mass.343.4102
SMILESFc1ccc(CCN2CCC3(CC2)CCc2ccccc2O3)c(F)c1