Reaction Details
TargetfMet-Leu-Phe receptor
LigandBDBM50026930
Substrate/Competitorn/a
Meas. Tech.ChEMBL_69352 (CHEMBL677588)
IC50>10000±n/a nM
Citation Loor, FTiberghien, FWenandy, TDidier, ATraber, R Cyclosporins: structure-activity relationships for the inhibition of the human FPR1 formylpeptide receptor. J Med Chem45:4613-28 (2002) fMet-Leu-Phe receptor
Name:fMet-Leu-Phe receptor
Type:Enzyme Catalytic Domain
Mol. Mass.:38456.14
Organism:Homo sapiens (Human)
Description:gi_4503779
Residue:350
BDBM50026930
NameBDBM50026930
Synonyms:CHEMBL2372458
TypeSmall organic molecule
Emp. Form.C60H109N11O11
Mol. Mass.1160.5746
SMILESCC(C)C[C@H]1N(C)C(=O)CN(C)C(=O)[C@@H](NC(=O)[C@H](CC(C)C)N(C)C(=O)[C@H](C(C)C)N(C)C(=O)[C@H](CC(C)C)N(C)C(=O)[C@H](CC(C)C)N(C)C(=O)[C@@H](C)NC(=O)[C@H](C)NC(=O)[C@@H](CC(C)C)N(C)C(=O)[C@@H](NC1=O)C(C)C)C(C)C