Reaction Details
TargetfMet-Leu-Phe receptor
LigandBDBM50026897
Substrate/Competitorn/a
Meas. Tech.ChEMBL_69352 (CHEMBL677588)
IC50 300±n/a nM
Citation Loor, FTiberghien, FWenandy, TDidier, ATraber, R Cyclosporins: structure-activity relationships for the inhibition of the human FPR1 formylpeptide receptor. J Med Chem45:4613-28 (2002) fMet-Leu-Phe receptor
Name:fMet-Leu-Phe receptor
Type:Enzyme Catalytic Domain
Mol. Mass.:38456.14
Organism:Homo sapiens (Human)
Description:gi_4503779
Residue:350
BDBM50026897
NameBDBM50026897
Synonyms:CHEMBL2372488
TypeSmall organic molecule
Emp. Form.C63H113N11O14
Mol. Mass.1248.6366
SMILES[H][C@]1(NC(=O)[C@]([H])([C@H](O)[C@H](C)C\C=C\C)N(C)C(=O)[C@H](C(C)C)N(C)C(=O)[C@H](CC(C)C)NC(=O)[C@H](CC(C)C)N(C)C(=O)[C@](O)(NC(=O)[C@H](C)NC(=O)[C@@H](CC(C)C)N(C)C(=O)[C@H](CC(C)C)NC(=O)[C@@H](CC(C)C)N(C)C(=O)CNC1=O)C(C)C)[C@@H](C)O