Reaction Details
TargetNociceptin receptor
LigandBDBM50121256
Substrate/Competitorn/a
Meas. Tech.ChEMBL_146117 (CHEMBL754586)
Ki 0.15±n/a nM
Citation Zhang, CMiller, WValenzano, KJKyle, DJ Novel, potent ORL-1 receptor agonist peptides containing alpha-Helix-promoting conformational constraints. J Med Chem45:5280-6 (2002) Nociceptin receptor
Name:Nociceptin receptor
Type:G Protein-Coupled Receptor (GPCR)
Mol. Mass.:40702.87
Organism:Homo sapiens (Human)
Description:P41146
Residue:370
BDBM50121256
NameBDBM50121256
Synonyms:CHEMBL410979 | F-G-G-F-T-G-A-R-K-S-A-R-K-L-Aib-N-Q-COOH
TypeSmall organic molecule
Emp. Form.C80H131N27O22
Mol. Mass.1823.0638
SMILESCC[C@H](NC(=O)[C@H](CC(C)C)NC(=O)[C@H](CCCCN)NC(=O)[C@H](CCCNC(N)=N)NC(=O)[C@H](C)NC(=O)[C@H](CO)NC(=O)[C@H](CCCCN)NC(=O)[C@H](CCCNC(N)=N)NC(=O)[C@H](C)NC(=O)CNC(=O)[C@@H](NC(=O)[C@H](Cc1ccccc1)NC(=O)CNC(=O)CNC(=O)[C@@H](N)Cc1ccccc1)[C@@H](C)O)C(=O)N[C@@H](CC(N)=O)C(=O)N[C@@H](CCC(N)=O)C(O)=O