Reaction Details
TargetMelanocortin receptor 5
LigandBDBM50121268
Substrate/Competitorn/a
Meas. Tech.ChEMBL_106512 (CHEMBL713016)
EC50 0.12±n/a nM
Citation Grieco, PLavecchia, ACai, MTrivedi, DWeinberg, DMacNeil, TVan der Ploeg, LHHruby, VJ Structure-activity studies of the melanocortin peptides: discovery of potent and selective affinity antagonists for the hMC3 and hMC4 receptors. J Med Chem45:5287-94 (2002) Melanocortin receptor 5
Name:Melanocortin receptor 5
Type:Enzyme
Mol. Mass.:36612.92
Organism:Homo sapiens (Human)
Description:P33032
Residue:325
BDBM50121268
NameBDBM50121268
Synonyms:21-(2-Acetylamino-hexanoylamino)-7-[3-(diaminomethaniminium)-propyl]-10-(1H-indol-3-ylmethyl)-4-naphthalen-2-ylmethyl-2,5,8,11,19,22-hexaoxo-3,6,9,12,18,23-hexaaza-tricyclo[21.7.0.0*24,29*]triaconta-24(29),25,27 CID44366078 | SHU-9119
TypeSmall organic molecule
Emp. Form.C54H71N15O9
Mol. Mass.1074.2366
SMILESCCCC[C@@H](NC(C)=O)C(=O)N[C@@H]1CC(=O)NCCCC[C@H](NC(=O)[C@H](Cc2c[nH]c3ccccc23)NC(=O)[C@H](CCCNC(N)=N)NC(=O)[C@@H](Cc2ccc3ccccc3c2)NC(=O)[C@H](Cc2c[nH]cn2)NC1=O)C(N)=O