Reaction Details
TargetMacrophage colony-stimulating factor 1 receptor
LigandBDBM4810
Substrate/Competitorn/a
Meas. Tech.ChEMBL_47910 (CHEMBL657537)
IC50 84±n/a nM
Citation Manley, PWFuret, PBold, GBrüggen, JMestan, JMeyer, TSchnell, CRWood, JHaberey, MHuth, AKrüger, MMenrad, AOttow, ESeidelmann, DSiemeister, GThierauch, KH Anthranilic acid amides: a novel class of antiangiogenic VEGF receptor kinase inhibitors. J Med Chem45:5687-93 (2002) Macrophage colony-stimulating factor 1 receptor
Name:Macrophage colony-stimulating factor 1 receptor
Type:Protein
Mol. Mass.:107979.48
Organism:Homo sapiens (Human)
Description:P07333
Residue:972
BDBM4810
NameBDBM4810
Synonyms:(3Z)-3-[(3,5-dimethyl-1H-pyrrol-2-yl)methylidene]-2,3-dihydro-1H-indol-2-one CHEMBL276711 SU5416 US10189853, semaxanib US9422297, SU5416 | cid_5329098
TypeSmall organic molecule
Emp. Form.C15H14N2O
Mol. Mass.238.2845
SMILESCc1cc(C)c(\C=C2/C(=O)Nc3ccccc23)[nH]1