Reaction Details
TargetMast/stem cell growth factor receptor Kit
LigandBDBM4851
Substrate/Competitorn/a
Meas. Tech.ChEMBL_105476 (CHEMBL708306)
IC50 620±n/a nM
Citation Manley, PWFuret, PBold, GBrüggen, JMestan, JMeyer, TSchnell, CRWood, JHaberey, MHuth, AKrüger, MMenrad, AOttow, ESeidelmann, DSiemeister, GThierauch, KH Anthranilic acid amides: a novel class of antiangiogenic VEGF receptor kinase inhibitors. J Med Chem45:5687-93 (2002) Mast/stem cell growth factor receptor Kit
Name:Mast/stem cell growth factor receptor Kit
Type:Protein
Mol. Mass.:109869.37
Organism:Homo sapiens (Human)
Description:P10721
Residue:976
BDBM4851
NameBDBM4851
Synonyms:(4-chlorophenyl)-[4-(4-pyridylmethyl)phthalazin-1-yl]amine CGP 79787 CHEMBL75232 N-(4-chlorophenyl)-4-(pyridin-4-ylmethyl)phthalazin-1-amine PTK787 cid_151194
TypeSmall organic molecule
Emp. Form.C20H15ClN4
Mol. Mass.346.813
SMILESClc1ccc(Nc2nnc(Cc3ccncc3)c3ccccc23)cc1