Reaction Details
TargetTyrosine-protein kinase ABL1
LigandBDBM4810
Substrate/Competitorn/a
Meas. Tech.ChEMBL_216524 (CHEMBL819334)
IC50>10000±n/a nM
Citation Manley, PWFuret, PBold, GBrüggen, JMestan, JMeyer, TSchnell, CRWood, JHaberey, MHuth, AKrüger, MMenrad, AOttow, ESeidelmann, DSiemeister, GThierauch, KH Anthranilic acid amides: a novel class of antiangiogenic VEGF receptor kinase inhibitors. J Med Chem45:5687-93 (2002) Tyrosine-protein kinase ABL1
Name:Tyrosine-protein kinase ABL1
Type:Enzyme
Mol. Mass.:122897.30
Organism:Homo sapiens (Human)
Description:P00519
Residue:1130
BDBM4810
NameBDBM4810
Synonyms:(3Z)-3-[(3,5-dimethyl-1H-pyrrol-2-yl)methylidene]-2,3-dihydro-1H-indol-2-one CHEMBL276711 SU5416 US10189853, semaxanib US9422297, SU5416 | cid_5329098
TypeSmall organic molecule
Emp. Form.C15H14N2O
Mol. Mass.238.2845
SMILESCc1cc(C)c(\C=C2/C(=O)Nc3ccccc23)[nH]1