Reaction Details
TargetProto-oncogene tyrosine-protein kinase Src
LigandBDBM9503
Substrate/Competitorn/a
Meas. Tech.ChEMBL_216845 (CHEMBL818268)
IC50>10000±n/a nM
Citation Manley, PWFuret, PBold, GBrüggen, JMestan, JMeyer, TSchnell, CRWood, JHaberey, MHuth, AKrüger, MMenrad, AOttow, ESeidelmann, DSiemeister, GThierauch, KH Anthranilic acid amides: a novel class of antiangiogenic VEGF receptor kinase inhibitors. J Med Chem45:5687-93 (2002) Proto-oncogene tyrosine-protein kinase Src
Name:Proto-oncogene tyrosine-protein kinase Src
Type:Protein
Mol. Mass.:59838.60
Organism:Homo sapiens (Human)
Description:P12931
Residue:536
BDBM9503
NameBDBM9503
Synonyms:2-[(pyridin-4-ylmethyl)amino]-N-[3-(trifluoromethyl)phenyl]benzamide anthranyl amide derivative C
TypeSmall organic molecule
Emp. Form.C20H16F3N3O
Mol. Mass.371.3557
SMILESFC(F)(F)c1cccc(NC(=O)c2ccccc2NCc2ccncc2)c1