Reaction Details
TargetMelanocortin receptor 3
LigandBDBM50122059
Substrate/Competitorn/a
Meas. Tech.ChEMBL_106838 (CHEMBL878355)
EC50 156±n/a nM
Citation Holder, JRXiang, ZBauzo, RMHaskell-Luevano, C Structure-activity relationships of the melanocortin tetrapeptide Ac-His-D-Phe-Arg-Trp-NH2 at the mouse melanocortin receptors. 4. Modifications at the Trp position. J Med Chem45:5736-44 (2002) Melanocortin receptor 3
Name:Melanocortin receptor 3
Type:PROTEIN
Mol. Mass.:35808.24
Organism:Mus musculus
Description:ChEMBL_1498848
Residue:323
BDBM50122059
NameBDBM50122059
Synonyms:Ac-His-D-Phe-Arg-Trp-NH2 | CHEMBL152612
TypeSmall organic molecule
Emp. Form.C34H43N11O5
Mol. Mass.685.7759
SMILESCC(=O)N[C@@H](Cc1cnc[nH]1)C(=O)N[C@@H](Cc1ccccc1)C(=O)N[C@@H](CCCNC(N)=N)C(=O)NC(Cc1c[nH]c2ccccc12)C(N)=O