Reaction Details
TargetMelanocortin receptor 4
LigandBDBM50122069
Substrate/Competitorn/a
Meas. Tech.ChEMBL_104251 (CHEMBL714369)
EC50 1000±n/a nM
Citation Holder, JRXiang, ZBauzo, RMHaskell-Luevano, C Structure-activity relationships of the melanocortin tetrapeptide Ac-His-D-Phe-Arg-Trp-NH2 at the mouse melanocortin receptors. 4. Modifications at the Trp position. J Med Chem45:5736-44 (2002) Melanocortin receptor 4
Name:Melanocortin receptor 4
Type:PROTEIN
Mol. Mass.:36964.43
Organism:Mus musculus
Description:ChEMBL_1498850
Residue:332
BDBM50122069
NameBDBM50122069
Synonyms:Ac-His-D-Phe-Arg-D-Phe-NH2 | CHEMBL154251
TypeSmall organic molecule
Emp. Form.C32H42N10O5
Mol. Mass.646.7399
SMILESCC(=O)N[C@@H](Cc1cnc[nH]1)C(=O)N[C@@H](Cc1ccccc1)C(=O)N[C@@H](CCCNC(N)=N)C(=O)N[C@@H](Cc1ccccc1)C(N)=O