Reaction Details
TargetMelanocortin receptor 5
LigandBDBM50122070
Substrate/Competitorn/a
Meas. Tech.ChEMBL_104262 (CHEMBL711699)
EC50 150±n/a nM
Citation Holder, JRXiang, ZBauzo, RMHaskell-Luevano, C Structure-activity relationships of the melanocortin tetrapeptide Ac-His-D-Phe-Arg-Trp-NH2 at the mouse melanocortin receptors. 4. Modifications at the Trp position. J Med Chem45:5736-44 (2002) Melanocortin receptor 5
Name:Melanocortin receptor 5
Type:Enzyme
Mol. Mass.:36966.58
Organism:Mus musculus (Mouse)
Description:P41149
Residue:325
BDBM50122070
NameBDBM50122070
Synonyms:Ac-His-D-Phe-Arg-D-Bip-NH2 | CHEMBL348901
TypeSmall organic molecule
Emp. Form.C38H46N10O5
Mol. Mass.722.8358
SMILESCC(=O)N[C@@H](Cc1cnc[nH]1)C(=O)N[C@@H](Cc1ccccc1)C(=O)N[C@@H](CCCNC(N)=N)C(=O)N[C@@H](Cc1ccc(cc1)-c1ccccc1)C(N)=O