Reaction Details
TargetMelanocyte-stimulating hormone receptor
LigandBDBM50122059
Substrate/Competitorn/a
Meas. Tech.ChEMBL_106823 (CHEMBL717664)
EC50 20.1±n/a nM
Citation Holder, JRXiang, ZBauzo, RMHaskell-Luevano, C Structure-activity relationships of the melanocortin tetrapeptide Ac-His-D-Phe-Arg-Trp-NH2 at the mouse melanocortin receptors. 4. Modifications at the Trp position. J Med Chem45:5736-44 (2002) Melanocyte-stimulating hormone receptor
Name:Melanocyte-stimulating hormone receptor
Type:PROTEIN
Mol. Mass.:35238.60
Organism:Mus musculus
Description:ChEMBL_1498846
Residue:315
BDBM50122059
NameBDBM50122059
Synonyms:Ac-His-D-Phe-Arg-Trp-NH2 | CHEMBL152612
TypeSmall organic molecule
Emp. Form.C34H43N11O5
Mol. Mass.685.7759
SMILESCC(=O)N[C@@H](Cc1cnc[nH]1)C(=O)N[C@@H](Cc1ccccc1)C(=O)N[C@@H](CCCNC(N)=N)C(=O)NC(Cc1c[nH]c2ccccc12)C(N)=O