Reaction Details
TargetMelanocortin receptor 3
LigandBDBM50122063
Substrate/Competitorn/a
Meas. Tech.ChEMBL_106838 (CHEMBL878355)
EC50 13400±n/a nM
Citation Holder, JRXiang, ZBauzo, RMHaskell-Luevano, C Structure-activity relationships of the melanocortin tetrapeptide Ac-His-D-Phe-Arg-Trp-NH2 at the mouse melanocortin receptors. 4. Modifications at the Trp position. J Med Chem45:5736-44 (2002) Melanocortin receptor 3
Name:Melanocortin receptor 3
Type:PROTEIN
Mol. Mass.:35808.24
Organism:Mus musculus
Description:ChEMBL_1498848
Residue:323
BDBM50122063
NameBDBM50122063
Synonyms:Ac-His-D-Phe-Arg-Bip-NH2 | CHEMBL347364
TypeSmall organic molecule
Emp. Form.C38H46N10O5
Mol. Mass.722.8358
SMILESCC(=O)N[C@@H](Cc1cnc[nH]1)C(=O)N[C@@H](Cc1ccccc1)C(=O)N[C@@H](CCCNC(N)=N)C(=O)N[C@H](Cc1ccc(cc1)-c1ccccc1)C(N)=O