Reaction Details
TargetMelanocortin receptor 5
LigandBDBM50122075
Substrate/Competitorn/a
Meas. Tech.ChEMBL_104262 (CHEMBL711699)
EC50 14500±n/a nM
Citation Holder, JRXiang, ZBauzo, RMHaskell-Luevano, C Structure-activity relationships of the melanocortin tetrapeptide Ac-His-D-Phe-Arg-Trp-NH2 at the mouse melanocortin receptors. 4. Modifications at the Trp position. J Med Chem45:5736-44 (2002) Melanocortin receptor 5
Name:Melanocortin receptor 5
Type:Enzyme
Mol. Mass.:36966.58
Organism:Mus musculus (Mouse)
Description:P41149
Residue:325
BDBM50122075
NameBDBM50122075
Synonyms:Ac-His-D-Phe-Arg-4Pal-NH2 | CHEMBL433522
TypeSmall organic molecule
Emp. Form.C31H41N11O5
Mol. Mass.647.7279
SMILESCC(=O)N[C@@H](Cc1cnc[nH]1)C(=O)N[C@@H](Cc1ccccc1)C(=O)N[C@@H](CCCNC(N)=N)C(=O)N[C@H](Cc1ccncc1)C(N)=O