Reaction Details
TargetMuscarinic acetylcholine receptor M1
LigandBDBM50109647
Substrate/Competitorn/a
Meas. Tech.ChEMBL_138405 (CHEMBL744767)
Ki 5.5±n/a nM
Citation Sagara, YSagara, TMase, TKimura, TNumazawa, TFujikawa, TNoguchi, KOhtake, N Cyclohexylmethylpiperidinyltriphenylpropioamide: a selective muscarinic M(3) antagonist discriminating against the other receptor subtypes. J Med Chem45:984-7 (2002) Muscarinic acetylcholine receptor M1
Name:Muscarinic acetylcholine receptor M1
Type:Protein
Mol. Mass.:51442.54
Organism:Homo sapiens (Human)
Description:P11229
Residue:460
BDBM50109647
NameBDBM50109647
Synonyms:2-{1-[2-(2,3-Dihydro-benzofuran-5-yl)-ethyl]-pyrrolidin-3-yl}-2,2-diphenyl-acetamide (Darifenacin) DARIFENACIN Enablex
TypeSmall organic molecule
Emp. Form.C28H30N2O2
Mol. Mass.426.55
SMILESNC(=O)C([C@@H]1CCN(CCc2ccc3OCCc3c2)C1)(c1ccccc1)c1ccccc1