Reaction Details
TargetCarbonic anhydrase 4
LigandBDBM50097289
Substrate/Competitorn/a
Meas. Tech.ChEMBL_45265 (CHEMBL658217)
Ki 5±n/a nM
Citation Scozzafava, AMenabuoni, LMincione, FSupuran, CT Carbonic anhydrase inhibitors. A general approach for the preparation of water-soluble sulfonamides incorporating polyamino-polycarboxylate tails and of their metal complexes possessing long-lasting, topical intraocular pressure-lowering properties. J Med Chem45:1466-76 (2002) Carbonic anhydrase 4
Name:Carbonic anhydrase 4
Type:Enzyme
Mol. Mass.:35152.74
Organism:Bos taurus (bovine)
Description:Bovine isozyme, isolated from lung microsomes
Residue:312
BDBM50097289
NameBDBM50097289
Synonyms:((2-{Carboxymethyl-[2-(carboxymethyl-{[3-methyl-5-sulfamoyl-3H-[1,3,4]thiadiazol-(2Z)-ylidenecarbamoyl]-methyl}-amino)-ethyl]-amino}-ethyl)-{[3-methyl-5-sulfamoyl-3H-[1,3,4]thiadiazol-(2E)-ylidenecarbamoyl]-methyl}-amino)-acetic acid CHEMBL1795056 Zinc; {{2-[Carboxymethyl-(2-{carboxymethyl-[(3-methyl-5-sulfamoyl-3H-[1,3,4]thiadiazol-2-ylidenecarbamoyl)-methyl]-amino}-ethyl)-amino]-ethyl}-[(3-methyl-5-sulfamoyl-3H-[1,3,4]thiadiazol-2-ylidenecarbamoyl)-methyl]-amino}-acetic acid
TypeSmall organic molecule
Emp. Form.C20H31N11O12S4
Mol. Mass.745.787
SMILESCn1nc(sc1=NC(=O)CN(CCN(CCN(CC(O)=O)CC(=O)N=c1sc(nn1C)S(N)(=O)=O)CC(O)=O)CC(O)=O)S(N)(=O)=O