Reaction Details
TargetCarbonic anhydrase 1
LigandBDBM50228327
Substrate/Competitorn/a
Meas. Tech.ChEMBL_47497 (CHEMBL662724)
Ki 7650±n/a nM
Citation Scozzafava, AMenabuoni, LMincione, FSupuran, CT Carbonic anhydrase inhibitors. A general approach for the preparation of water-soluble sulfonamides incorporating polyamino-polycarboxylate tails and of their metal complexes possessing long-lasting, topical intraocular pressure-lowering properties. J Med Chem45:1466-76 (2002) Carbonic anhydrase 1
Name:Carbonic anhydrase 1
Type:Enzyme
Mol. Mass.:28873.37
Organism:Homo sapiens (Human)
Description:P00915
Residue:261
BDBM50228327
NameBDBM50228327
Synonyms:CHEMBL285962 | {(2-{carboxymethyl-[(3-sulfamoyl-phenylcarbamoyl)-methyl]-amino}-ethyl)-[(3-sulfamoyl-phenylcarbamoyl)-methyl]-amino}-acetic acid
TypeSmall organic molecule
Emp. Form.C22H28N6O10S2
Mol. Mass.600.622
SMILESNS(=O)(=O)c1cccc(NC(=O)CN(CCN(CC(O)=O)CC(=O)Nc2cccc(c2)S(N)(=O)=O)CC(O)=O)c1