Reaction Details
TargetCarbonic anhydrase 2
LigandBDBM50292132
Substrate/Competitorn/a
Meas. Tech.ChEMBL_45044 (CHEMBL658042)
Ki 0.8±n/a nM
Citation Scozzafava, AMenabuoni, LMincione, FSupuran, CT Carbonic anhydrase inhibitors. A general approach for the preparation of water-soluble sulfonamides incorporating polyamino-polycarboxylate tails and of their metal complexes possessing long-lasting, topical intraocular pressure-lowering properties. J Med Chem45:1466-76 (2002) Carbonic anhydrase 2
Name:Carbonic anhydrase 2
Type:Enzyme
Mol. Mass.:29250.71
Organism:Homo sapiens (Human)
Description:P00918
Residue:260
BDBM50292132
NameBDBM50292132
Synonyms:CHEMBL286131 | {(2-{2-[2-(Bis-carboxymethyl-amino)-ethoxy]-ethoxy}-ethyl)-[2-(2-sulfamoyl-benzothiazol-6-yloxy)-ethoxycarbonylmethyl]-amino}-acetic acid
TypeSmall organic molecule
Emp. Form.C23H32N4O13S2
Mol. Mass.636.649
SMILESNS(=O)(=O)c1nc2ccc(OCCOC(=O)CN(CCOCCOCCN(CC(O)=O)CC(O)=O)CC(O)=O)cc2s1