Reaction Details
TargetCarbonic anhydrase 2
LigandBDBM50292100
Substrate/Competitorn/a
Meas. Tech.ChEMBL_45044 (CHEMBL658042)
Ki 0.5±n/a nM
Citation Scozzafava, AMenabuoni, LMincione, FSupuran, CT Carbonic anhydrase inhibitors. A general approach for the preparation of water-soluble sulfonamides incorporating polyamino-polycarboxylate tails and of their metal complexes possessing long-lasting, topical intraocular pressure-lowering properties. J Med Chem45:1466-76 (2002) Carbonic anhydrase 2
Name:Carbonic anhydrase 2
Type:Enzyme
Mol. Mass.:29250.71
Organism:Homo sapiens (Human)
Description:P00918
Residue:260
BDBM50292100
NameBDBM50292100
Synonyms:CHEMBL284354 | {{2-[2-(2-{Carboxymethyl-[(2-sulfamoyl-benzothiazol-6-ylcarbamoyl)-methyl]-amino}-ethoxy)-ethoxy]-ethyl}-[(2-sulfamoyl-benzothiazol-6-ylcarbamoyl)-methyl]-amino}-acetic acid
TypeSmall organic molecule
Emp. Form.C28H34N8O12S4
Mol. Mass.802.876
SMILESNS(=O)(=O)c1nc2ccc(NC(=O)CN(CCOCCOCCN(CC(O)=O)CC(=O)Nc3ccc4nc(sc4c3)S(N)(=O)=O)CC(O)=O)cc2s1