Reaction Details
TargetAcetylcholinesterase
LigandBDBM8958
Substrate/Competitorn/a
Meas. Tech.ChEMBL_27955 (CHEMBL649135)
Ki 173200±n/a nM
Citation Savini, LGaeta, AFattorusso, CCatalanotti, BCampiani, GChiasserini, LPellerano, CNovellino, EMcKissic, DSaxena, A Specific targeting of acetylcholinesterase and butyrylcholinesterase recognition sites. Rational design of novel, selective, and highly potent cholinesterase inhibitors. J Med Chem46:1-4 (2002) 
 
Acetylcholinesterase
Name:Acetylcholinesterase
Type:Enzyme
Mol. Mass.:67659.62
Organism:Bos taurus (bovine)
Description:n/a
Residue:613
BDBM8958
NameBDBM8958
Synonyms:10-(2-diethylaminopropyl)phenothiazine CHEMBL1206 diethyl[1-(10H-phenothiazin-10-yl)propan-2-yl]amine
TypeSmall organic molecule
Emp. Form.C19H24N2S
Mol. Mass.312.472
SMILESCCN(CC)C(C)CN1c2ccccc2Sc2ccccc12