Reaction Details
TargetAcetylcholinesterase
LigandBDBM50122491
Substrate/Competitorn/a
Meas. Tech.ChEMBL_27955 (CHEMBL649135)
Ki 210±n/a nM
Citation Savini, LGaeta, AFattorusso, CCatalanotti, BCampiani, GChiasserini, LPellerano, CNovellino, EMcKissic, DSaxena, A Specific targeting of acetylcholinesterase and butyrylcholinesterase recognition sites. Rational design of novel, selective, and highly potent cholinesterase inhibitors. J Med Chem46:1-4 (2002) 
 
Acetylcholinesterase
Name:Acetylcholinesterase
Type:Enzyme
Mol. Mass.:67659.62
Organism:Bos taurus (bovine)
Description:n/a
Residue:613
BDBM50122491
NameBDBM50122491
Synonyms:(1,2,3,4-Tetrahydro-acridin-9-yl)-[5-(1,2,3,4-tetrahydro-acridin-9-ylsulfanyl)-pentyl]-amine | CHEMBL129719
TypeSmall organic molecule
Emp. Form.C31H35N3S
Mol. Mass.481.695
SMILESC(CCNc1c2CCCCc2nc2ccccc12)CCSc1c2CCCCc2nc2ccccc12