Reaction Details
TargetCholinesterase
LigandBDBM10519
Substrate/Competitorn/a
Meas. Tech.ChEMBL_41269 (CHEMBL655026)
Ki 180±n/a nM
Citation Savini, LGaeta, AFattorusso, CCatalanotti, BCampiani, GChiasserini, LPellerano, CNovellino, EMcKissic, DSaxena, A Specific targeting of acetylcholinesterase and butyrylcholinesterase recognition sites. Rational design of novel, selective, and highly potent cholinesterase inhibitors. J Med Chem46:1-4 (2002) 
 
Cholinesterase
Name:Cholinesterase
Type:Homotetramer
Mol. Mass.:68422.27
Organism:Homo sapiens (Human)
Description:P06276
Residue:602
BDBM10519
NameBDBM10519
Synonyms:CHEMBL51350 tacrine heterobivalent compound 3c
TypeSmall organic molecule
Emp. Form.C33H38Cl2N4
Mol. Mass.561.588
SMILESClc1cc(Cl)c2c(NCCCCCCCNc3c4CCCCc4nc4ccccc34)c3CCCCc3nc2c1