Reaction Details
TargetKappa-type opioid receptor
LigandBDBM50027005
Substrate/Competitorn/a
Meas. Tech.ChEMBL_145111 (CHEMBL751994)
IC50 3410±n/a nM
Citation Hanessian, SParthasarathy, SMauduit, MPayza, K The power of visual imagery in drug design. Isopavines as a new class of morphinomimetics and their human opioid receptor binding activity. J Med Chem46:34-48 (2002) 
 
Kappa-type opioid receptor
Name:Kappa-type opioid receptor
Type:G Protein-Coupled Receptor (GPCR)
Mol. Mass.:42648.76
Organism:Homo sapiens (Human)
Description:P41145
Residue:380
BDBM50027005
NameBDBM50027005
Synonyms:CHEMBL2112843
TypeSmall organic molecule
Emp. Form.C20H23N
Mol. Mass.277.4033
SMILES[H][C@@]12Cc3ccccc3[C@@]([H])(c3ccccc13)[C@]([H])(C(C)C)N2C