Reaction Details
TargetDelta-type opioid receptor
LigandBDBM50122521
Substrate/Competitorn/a
Meas. Tech.ChEMBL_145336 (CHEMBL750571)
IC50 2040±n/a nM
Citation Hanessian, SParthasarathy, SMauduit, MPayza, K The power of visual imagery in drug design. Isopavines as a new class of morphinomimetics and their human opioid receptor binding activity. J Med Chem46:34-48 (2002) 
 
Delta-type opioid receptor
Name:Delta-type opioid receptor
Type:G Protein-Coupled Receptor (GPCR)
Mol. Mass.:40382.98
Organism:Homo sapiens (Human)
Description:Competition binding assays were carried out using membrane preparations from transfected HN9.10 cells that constitutively expressed the delta opioid receptor.
Residue:372
BDBM50122521
NameBDBM50122521
Synonyms:17-cyclopropylmethyl-16-methyl-4,13-di(4-methylhexahydro-1-pyrazinyl)-(16R)-17-azatetracyclo[7.6.2.02,7.010,15]heptadeca-2(7),3,5,12,14-pentaene
TypeSmall organic molecule
Emp. Form.C31H45N5
Mol. Mass.487.7225
SMILESC[C@@H]1[C@@H]2C3=CC(=CC[C@H]3[C@H](Cc3ccc(cc23)N2CCN(C)CC2)N1CC1CC1)N1CCN(C)CC1