Reaction Details
TargetDelta-type opioid receptor
LigandBDBM50122531
Substrate/Competitorn/a
Meas. Tech.ChEMBL_145336 (CHEMBL750571)
IC50 3800±n/a nM
Citation Hanessian, SParthasarathy, SMauduit, MPayza, K The power of visual imagery in drug design. Isopavines as a new class of morphinomimetics and their human opioid receptor binding activity. J Med Chem46:34-48 (2002) 
 
Delta-type opioid receptor
Name:Delta-type opioid receptor
Type:G Protein-Coupled Receptor (GPCR)
Mol. Mass.:40382.98
Organism:Homo sapiens (Human)
Description:Competition binding assays were carried out using membrane preparations from transfected HN9.10 cells that constitutively expressed the delta opioid receptor.
Residue:372
BDBM50122531
NameBDBM50122531
Synonyms:20-azapentacyclo[7.6.5.02,7.010,15.016,20]icosa-2(7),3,5,12,14-pentaene-4,13-diol
TypeSmall organic molecule
Emp. Form.C19H21NO2
Mol. Mass.295.3755
SMILESOc1ccc2C[C@H]3[C@@H]4CCC(=O)C=C4[C@@H]([C@@H]4CCCN34)c2c1