Reaction Details
TargetDelta-type opioid receptor
LigandBDBM50027010
Substrate/Competitorn/a
Meas. Tech.ChEMBL_145336 (CHEMBL750571)
IC50>10000±n/a nM
Citation Hanessian, SParthasarathy, SMauduit, MPayza, K The power of visual imagery in drug design. Isopavines as a new class of morphinomimetics and their human opioid receptor binding activity. J Med Chem46:34-48 (2002) 
 
Delta-type opioid receptor
Name:Delta-type opioid receptor
Type:G Protein-Coupled Receptor (GPCR)
Mol. Mass.:40382.98
Organism:Homo sapiens (Human)
Description:Competition binding assays were carried out using membrane preparations from transfected HN9.10 cells that constitutively expressed the delta opioid receptor.
Residue:372
BDBM50027010
NameBDBM50027010
Synonyms:CHEMBL2112838
TypeSmall organic molecule
Emp. Form.C18H19N
Mol. Mass.249.3502
SMILES[H][C@@]12Cc3ccccc3[C@@]([H])(c3ccccc13)[C@]([H])(C)N2C