Reaction Details
TargetKappa-type opioid receptor
LigandBDBM50122538
Substrate/Competitorn/a
Meas. Tech.ChEMBL_145111 (CHEMBL751994)
IC50>5800±n/a nM
Citation Hanessian, SParthasarathy, SMauduit, MPayza, K The power of visual imagery in drug design. Isopavines as a new class of morphinomimetics and their human opioid receptor binding activity. J Med Chem46:34-48 (2002) 
 
Kappa-type opioid receptor
Name:Kappa-type opioid receptor
Type:G Protein-Coupled Receptor (GPCR)
Mol. Mass.:42648.76
Organism:Homo sapiens (Human)
Description:P41145
Residue:380
BDBM50122538
NameBDBM50122538
Synonyms:16-methyl-17-azatetracyclo[7.6.2.02,7.010,15]heptadeca-2(7),3,5,12,14-pentaen-17-yl(phenyl)methane
TypeSmall organic molecule
Emp. Form.C24H25N
Mol. Mass.327.462
SMILESC[C@@H]1[C@@H]2C3=CC=CC[C@H]3[C@H](Cc3ccccc23)N1Cc1ccccc1