Reaction Details
TargetMu-type opioid receptor
LigandBDBM50122530
Substrate/Competitorn/a
Meas. Tech.ChEMBL_145593 (CHEMBL749738)
IC50 690±n/a nM
Citation Hanessian, SParthasarathy, SMauduit, MPayza, K The power of visual imagery in drug design. Isopavines as a new class of morphinomimetics and their human opioid receptor binding activity. J Med Chem46:34-48 (2002) 
 
Mu-type opioid receptor
Name:Mu-type opioid receptor
Type:G Protein-Coupled Receptor (GPCR)
Mol. Mass.:44789.51
Organism:Homo sapiens (Human)
Description:P35372
Residue:400
BDBM50122530
NameBDBM50122530
Synonyms:4-[16,17-dimethyl-13-(1,4-oxazinan-4-yl)-17-azatetracyclo[7.6.2.02,7.010,15]heptadeca-2(7),3,5,12,14-pentaen-4-yl]-1,4-oxazinane
TypeSmall organic molecule
Emp. Form.C26H35N3O2
Mol. Mass.421.575
SMILESC[C@@H]1[C@@H]2C3=CC(=CC[C@H]3[C@H](Cc3ccc(cc23)N2CCOCC2)N1C)N1CCOCC1