Reaction Details
TargetKappa-type opioid receptor
LigandBDBM50122519
Substrate/Competitorn/a
Meas. Tech.ChEMBL_145111 (CHEMBL751994)
IC50>9500±n/a nM
Citation Hanessian, SParthasarathy, SMauduit, MPayza, K The power of visual imagery in drug design. Isopavines as a new class of morphinomimetics and their human opioid receptor binding activity. J Med Chem46:34-48 (2002) 
 
Kappa-type opioid receptor
Name:Kappa-type opioid receptor
Type:G Protein-Coupled Receptor (GPCR)
Mol. Mass.:42648.76
Organism:Homo sapiens (Human)
Description:P41145
Residue:380
BDBM50122519
NameBDBM50122519
Synonyms:16,17-dimethyl-13-methylcarbonyloxy-17-azatetracyclo[7.6.2.02,7.010,15]heptadeca-2(7),3,5,12,14-pentaen-4-yl acetate
TypeSmall organic molecule
Emp. Form.C22H25NO4
Mol. Mass.367.4382
SMILESC[C@@H]1[C@@H]2C3=CC(OC(C)=O)=CC[C@H]3[C@H](Cc3ccc(OC(C)=O)cc23)N1C