Reaction Details
TargetEpidermal growth factor receptor
LigandBDBM50122564
Substrate/Competitorn/a
Meas. Tech.ChEMBL_66597 (CHEMBL680028)
IC50 2290±n/a nM
Citation Wissner, AOverbeek, EReich, MFFloyd, MBJohnson, BDMamuya, NRosfjord, ECDiscafani, CDavis, RShi, XRabindran, SKGruber, BCYe, FHallett, WANilakantan, RShen, RWang, YFGreenberger, LMTsou, HR Synthesis and structure-activity relationships of 6,7-disubstituted 4-anilinoquinoline-3-carbonitriles. The design of an orally active, irreversible inhibitor of the tyrosine kinase activity of the epidermal growth factor receptor (EGFR) and the human epidermal growth factor receptor-2 (HER-2). J Med Chem46:49-63 (2002) 
 
Epidermal growth factor receptor
Name:Epidermal growth factor receptor
Type:Receptor Kinase Domain
Mol. Mass.:134279.59
Organism:Homo sapiens (Human)
Description:P00533
Residue:1210
BDBM50122564
NameBDBM50122564
Synonyms:(E)-4-Morpholin-4-yl-but-2-enoic acid [4-(3-chloro-4-fluoro-phenylamino)-3-cyano-quinolin-6-yl]-amide CHEMBL118000
TypeSmall organic molecule
Emp. Form.C24H21ClFN5O2
Mol. Mass.465.907
SMILESFc1ccc(Nc2c(cnc3ccc(NC(=O)\C=C\CN4CCOCC4)cc23)C#N)cc1Cl