Reaction Details
TargetReceptor tyrosine-protein kinase erbB-2
LigandBDBM50122569
Substrate/Competitorn/a
Meas. Tech.ChEMBL_161599 (CHEMBL769139)
IC50 380±n/a nM
Citation Wissner, AOverbeek, EReich, MFFloyd, MBJohnson, BDMamuya, NRosfjord, ECDiscafani, CDavis, RShi, XRabindran, SKGruber, BCYe, FHallett, WANilakantan, RShen, RWang, YFGreenberger, LMTsou, HR Synthesis and structure-activity relationships of 6,7-disubstituted 4-anilinoquinoline-3-carbonitriles. The design of an orally active, irreversible inhibitor of the tyrosine kinase activity of the epidermal growth factor receptor (EGFR) and the human epidermal growth factor receptor-2 (HER-2). J Med Chem46:49-63 (2002) 
 
Receptor tyrosine-protein kinase erbB-2
Name:Receptor tyrosine-protein kinase erbB-2
Type:n/a
Mol. Mass.:137894.47
Organism:Homo sapiens (Human)
Description:P04626
Residue:1255
BDBM50122569
NameBDBM50122569
Synonyms:3-Methoxymethoxy-propynoic acid [4-(3-bromo-phenylamino)-3-cyano-quinolin-6-yl]-amide | CHEMBL414631
TypeSmall organic molecule
Emp. Form.C21H15BrN4O3
Mol. Mass.451.273
SMILESCOCOC#CC(=O)Nc1ccc2ncc(C#N)c(Nc3cccc(Br)c3)c2c1