Reaction Details
TargetReverse transcriptase/RNaseH
LigandBDBM50127514
Substrate/Competitorn/a
Meas. Tech.ChEMBL_195507 (CHEMBL798928)
IC50 150±n/a nM
Citation Hyde, RMBroom, ADBuckheit, RW Antiviral amphipathic oligo- and polyribonucleotides: analogue development and biological studies. J Med Chem46:1878-85 (2003) 
 
Reverse transcriptase/RNaseH
Name:Reverse transcriptase/RNaseH
Type:PROTEIN
Mol. Mass.:65229.15
Organism:Human immunodeficiency virus 1
Description:ChEMBL_1473730
Residue:566
BDBM50127514
NameBDBM50127514
Synonyms:4-methoxy-2-(methoxymethyl)-5-(6-oxo-1-prop-2-ynyl-1,6-dihydro-9H-purin-9-yl)tetrahydrofuran-3-yl methylphosphonate
TypeSmall organic molecule
Emp. Form.C16H20N4O7P
Mol. Mass.411.3269
SMILESCOC[C@H]1O[C@H](C(OC)[C@H]1OP(C)([O-])=O)n1cnc2c1ncn(CC#C)c2=O