Reaction Details
TargetMu-type opioid receptor
LigandBDBM50128077
Substrate/Competitorn/a
Meas. Tech.ChEMBL_148222 (CHEMBL754712)
Ki 38±n/a nM
Citation Schlechtingen, GDeHaven, RNDaubert, JDCassel, JAChung, NNSchiller, PWTaulane, JPGoodman, M Structure-activity relationships of dynorphin a analogues modified in the address sequence. J Med Chem46:2104-9 (2003) 
 
Mu-type opioid receptor
Name:Mu-type opioid receptor
Type:G Protein-Coupled Receptor (GPCR)
Mol. Mass.:44789.51
Organism:Homo sapiens (Human)
Description:P35372
Residue:400
BDBM50128077
NameBDBM50128077
Synonyms:CHEMBL293465 | Tyr-Gly-Gly-Phe-Leu-Arg-Arg-OH
TypeSmall organic molecule
Emp. Form.C40H61N13O9
Mol. Mass.867.994
SMILESCC(C)C[C@H](NC(=O)[C@H](Cc1ccccc1)NC(=O)CNC(=O)CNC(=O)[C@@H](N)Cc1ccc(O)cc1)C(=O)N[C@@H](CCCNC(N)=N)C(=O)N[C@@H](CCCNC(N)=N)C(O)=O