Reaction Details
TargetMu-type opioid receptor
LigandBDBM50128076
Substrate/Competitorn/a
Meas. Tech.ChEMBL_148222 (CHEMBL754712)
Ki 15500±n/a nM
Citation Schlechtingen, GDeHaven, RNDaubert, JDCassel, JAChung, NNSchiller, PWTaulane, JPGoodman, M Structure-activity relationships of dynorphin a analogues modified in the address sequence. J Med Chem46:2104-9 (2003) 
 
Mu-type opioid receptor
Name:Mu-type opioid receptor
Type:G Protein-Coupled Receptor (GPCR)
Mol. Mass.:44789.51
Organism:Homo sapiens (Human)
Description:P35372
Residue:400
BDBM50128076
NameBDBM50128076
Synonyms:CHEMBL2369407 | Tyr-Gly-Pro-Phe-Leu-Arg-Arg-Arg-NH2
TypeSmall organic molecule
Emp. Form.C31H42N6O6
Mol. Mass.594.7018
SMILESCC(C)C[C@H](NC(=O)[C@H](Cc1ccccc1)NC(=O)[C@@H]1CCCN1C(=O)CNC(=O)[C@@H](N)Cc1ccc(O)cc1)C(N)=O