Reaction Details
Target3-beta-hydroxysteroid-Delta(8),Delta(7)-isomerase
LigandBDBM50128104
Substrate/Competitorn/a
Meas. Tech.ChEMBL_203193 (CHEMBL804438)
Ki 14.5±n/a nM
Citation Berardi, FLoiodice, FFracchiolla, GColabufo, NAPerrone, RTortorella, V Synthesis of chiral 1-[omega-(4-chlorophenoxy)alkyl]-4-methylpiperidines and their biological evaluation at sigma1, sigma2, and sterol delta8-delta7 isomerase sites. J Med Chem46:2117-24 (2003) 
 
3-beta-hydroxysteroid-Delta(8),Delta(7)-isomerase
Name:3-beta-hydroxysteroid-Delta(8),Delta(7)-isomerase
Type:PROTEIN
Mol. Mass.:26684.52
Organism:Cavia porcellus
Description:ChEMBL_203193
Residue:229
BDBM50128104
NameBDBM50128104
Synonyms:1-[3-(4-Chloro-phenoxy)-2-methyl-propyl]-4-methyl-piperidine; hydrochloride | CHEMBL539776
TypeSmall organic molecule
Emp. Form.C16H24ClNO
Mol. Mass.281.821
SMILESC[C@H](COc1ccc(Cl)cc1)CN1CCC(C)CC1