Reaction Details
Target3-beta-hydroxysteroid-Delta(8),Delta(7)-isomerase
LigandBDBM50128108
Substrate/Competitorn/a
Meas. Tech.ChEMBL_203193 (CHEMBL804438)
Ki 27.5±n/a nM
Citation Berardi, FLoiodice, FFracchiolla, GColabufo, NAPerrone, RTortorella, V Synthesis of chiral 1-[omega-(4-chlorophenoxy)alkyl]-4-methylpiperidines and their biological evaluation at sigma1, sigma2, and sterol delta8-delta7 isomerase sites. J Med Chem46:2117-24 (2003) 
 
3-beta-hydroxysteroid-Delta(8),Delta(7)-isomerase
Name:3-beta-hydroxysteroid-Delta(8),Delta(7)-isomerase
Type:PROTEIN
Mol. Mass.:26684.52
Organism:Cavia porcellus
Description:ChEMBL_203193
Residue:229
BDBM50128108
NameBDBM50128108
Synonyms:1-[2-(4-Chloro-phenoxy)-1-methyl-ethyl]-4-methyl-piperidine; hydrochloride | CHEMBL542873
TypeSmall organic molecule
Emp. Form.C15H22ClNO
Mol. Mass.267.794
SMILESC[C@H](COc1ccc(Cl)cc1)N1CCC(C)CC1