Reaction Details
TargetCarbonic anhydrase 1
LigandBDBM50098102
Substrate/Competitorn/a
Meas. Tech.ChEMBL_44852 (CHEMBL653166)
Ki 4.6±n/a nM
Citation Winum, JYVullo, DCasini, AMontero, JLScozzafava, ASupuran, CT Carbonic anhydrase inhibitors. Inhibition of cytosolic isozymes I and II and transmembrane, tumor-associated isozyme IX with sulfamates including EMATE also acting as steroid sulfatase inhibitors. J Med Chem46:2197-204 (2003) 
 
Carbonic anhydrase 1
Name:Carbonic anhydrase 1
Type:Enzyme
Mol. Mass.:28873.37
Organism:Homo sapiens (Human)
Description:P00915
Residue:261
BDBM50098102
NameBDBM50098102
Synonyms:CHEMBL23350 | Sulfamic acid 4-chloro-phenyl ester
TypeSmall organic molecule
Emp. Form.C6H6ClNO3S
Mol. Mass.207.635
SMILESNS(=O)(=O)Oc1ccc(Cl)cc1