Reaction Details
TargetSteroid 17-alpha-hydroxylase/17,20 lyase
LigandBDBM50128544
Substrate/Competitorn/a
Meas. Tech.ChEMBL_50527 (CHEMBL661144)
IC50 915±n/a nM
Citation Clement, OOFreeman, CMHartmann, RWHandratta, VDVasaitis, TSBrodie, AMNjar, VC Three dimensional pharmacophore modeling of human CYP17 inhibitors. Potential agents for prostate cancer therapy. J Med Chem46:2345-51 (2003) 
 
Steroid 17-alpha-hydroxylase/17,20 lyase
Name:Steroid 17-alpha-hydroxylase/17,20 lyase
Type:Enzyme
Mol. Mass.:57382.42
Organism:Homo sapiens (Human)
Description:E.coli expressing human CYP17
Residue:508
BDBM50128544
NameBDBM50128544
Synonyms:(10R,13S)-17-Benzoimidazol-1-yl-10,13-dimethyl-1,2,6,7,8,9,10,11,12,13,14,15-dodecahydro-cyclopenta[a]phenanthren-3-one | CHEMBL77789
TypeSmall organic molecule
Emp. Form.C26H30N2O
Mol. Mass.386.5292
SMILESC[C@]12CCC3C(CCC4=CC(=O)CC[C@]34C)C1CC=C2n1cnc2ccccc12