Reaction Details
TargetSteroid 17-alpha-hydroxylase/17,20 lyase
LigandBDBM50370218
Substrate/Competitorn/a
Meas. Tech.ChEMBL_50523 (CHEMBL661140)
Ki 505±n/a nM
Citation Clement, OOFreeman, CMHartmann, RWHandratta, VDVasaitis, TSBrodie, AMNjar, VC Three dimensional pharmacophore modeling of human CYP17 inhibitors. Potential agents for prostate cancer therapy. J Med Chem46:2345-51 (2003) 
 
Steroid 17-alpha-hydroxylase/17,20 lyase
Name:Steroid 17-alpha-hydroxylase/17,20 lyase
Type:Enzyme
Mol. Mass.:57382.42
Organism:Homo sapiens (Human)
Description:E.coli expressing human CYP17
Residue:508
BDBM50370218
NameBDBM50370218
Synonyms:TIOCONAZOLE
TypeSmall organic molecule
Emp. Form.C16H13Cl3N2OS
Mol. Mass.387.711
SMILESClc1sccc1COC(Cn1ccnc1)c1ccc(Cl)cc1Cl